openAuto building | pressku.com

Trending 1 month ago

the building process of openauto task gives this correction tin anyone help?

abdelrahman@ubuntu:~/Downloads/openauto-1.1.1/build$ make Scanning limitations of target btservice_autogen [ 2%] Automatic MOC and UIC for target btservice [ 2%] Built target btservice_autogen Scanning limitations of target btservice [ 4%] Building CXX entity CMakeFiles/btservice.dir/btservice_autogen/mocs_compilation.cpp.o [ 7%] Building CXX entity CMakeFiles/btservice.dir/src/btservice/AndroidBluetoothServer.cpp.o [ 9%] Building CXX entity CMakeFiles/btservice.dir/src/btservice/AndroidBluetoothService.cpp.o [ 11%] Building CXX entity CMakeFiles/btservice.dir/src/btservice/btservice.cpp.o [ 14%] Linking CXX executable ../bin/btservice /usr/bin/ld: CMakeFiles/btservice.dir/src/btservice/AndroidBluetoothServer.cpp.o: successful usability boost::log::v2_mt_posix::aux::record_pump<boost::log::v2_mt_posix::sources::severity_logger_mt<boost::log::v2_mt_posix::trivial::severity_level> >::~record_pump()': AndroidBluetoothServer.cpp:(.text._ZN5boost3log11v2_mt_posix3aux11record_pumpINS1_7sources18severity_logger_mtINS1_7trivial14severity_levelEEEED2Ev[_ZN5boost3log11v2_mt_posix3aux11record_pumpINS1_7sources18severity_logger_mtINS1_7trivial14severity_levelEEEED5Ev]+0x4f): undefined reference to boost::log::v2_mt_posix::aux::unhandled_exception_count()' /usr/bin/ld: CMakeFiles/btservice.dir/src/btservice/AndroidBluetoothServer.cpp.o: successful usability boost::log::v2_mt_posix::aux::record_pump<boost::log::v2_mt_posix::sources::severity_logger_mt<boost::log::v2_mt_posix::trivial::severity_level> >::record_pump(boost::log::v2_mt_posix::sources::severity_logger_mt<boost::log::v2_mt_posix::trivial::severity_level>&, boost::log::v2_mt_posix::record&)': AndroidBluetoothServer.cpp:(.text._ZN5boost3log11v2_mt_posix3aux11record_pumpINS1_7sources18severity_logger_mtINS1_7trivial14severity_levelEEEEC2ERS8_RNS1_6recordE[_ZN5boost3log11v2_mt_posix3aux11record_pumpINS1_7sources18severity_logger_mtINS1_7trivial14severity_levelEEEEC5ERS8_RNS1_6recordE]+0x40): undefined reference to boost::log::v2_mt_posix::aux::unhandled_exception_count()' collect2: error: ld returned 1 exit status make[2]: *** [CMakeFiles/btservice.dir/build.make:146: ../bin/btservice] Error 1 make[1]: *** [CMakeFiles/Makefile2:80: CMakeFiles/btservice.dir/all] Error 2 make: *** [Makefile:84: all] Error 2

More
close