aasdk library building | pressku.com

Trending 2 months ago

iam tring to instal this room for openauto and one faced this correction during nan build this room tin anyone thief me?

In record included from /home/abdelrahman/aasdk/include/f1x/aasdk/IO/PromiseLink.hpp:24, from /home/abdelrahman/aasdk/src/Channel/Control/ControlServiceChannel.cpp:22: /home/abdelrahman/aasdk/include/f1x/aasdk/IO/Promise.hpp:35:1: error: expected class-name earlier ‘{’ token 35 | { | ^ /home/abdelrahman/aasdk/include/f1x/aasdk/IO/Promise.hpp:117:1: error: expected class-name earlier ‘{’ token 117 | { | ^ /home/abdelrahman/aasdk/include/f1x/aasdk/IO/Promise.hpp:198:1: error: expected class-name earlier ‘{’ token 198 | { | ^ /home/abdelrahman/aasdk/include/f1x/aasdk/IO/Promise.hpp:278:1: error: expected class-name earlier ‘{’ token 278 | { | ^ make[2]: *** [CMakeFiles/aasdk.dir/build.make:154: CMakeFiles/aasdk.dir/src/Channel/Control/ControlServiceChannel.cpp.o] Error 1 make[1]: *** [CMakeFiles/Makefile2:96: CMakeFiles/aasdk.dir/all] Error 2 make: *** [Makefile:84: all] Error 2

More
close